Target
Sphingosine 1-phosphate receptor 1
Ligand
BDBM50034624
Substrate
Meas. Tech.
ChEMBL_1439469 (CHEMBL3381246)
EC50
316±n/a nM
Citation
 Skidmore, JHeer, JJohnson, CNNorton, DRedshaw, SSweeting, JHurst, DCridland, AVesey, DWall, IAhmed, MRivers, DMyatt, JGiblin, GPhilpott, KKumar, UStevens, ABit, RAHaynes, ATaylor, SWatson, RWitherington, JDemont, EHeightman, TD Optimization of sphingosine-1-phosphate-1 receptor agonists: effects of acidic, basic, and zwitterionic chemotypes on pharmacokinetic and pharmacodynamic profiles. J Med Chem 57:10424-42 (2014)  
Target
Name:
Sphingosine 1-phosphate receptor 1
Synonyms:
CHEDG1 Endothelial differentiation G-protein coupled receptor 1 S1P1 S1PR1_HUMAN Sphingosine 1-phosphate receptor Edg-1
Type:
Enzyme
Mol. Mass.:
42836.02
Organism:
Homo sapiens (Human)
Description:
P21453
Residue:
382
  
Inhibitor
Name:
BDBM50034624
Synonyms:
CHEMBL3360371
Type:
Small organic molecule
Emp. Form.:
C20H20ClN3O3
Mol. Mass.:
385.844
SMILES:
CC(C)Oc1ccc(cc1Cl)-c1nc(no1)-c1ccc2CNCCOc2c1
: