Target
Nuclear receptor ROR-beta
Ligand
BDBM50035918
Substrate
Meas. Tech.
ChEMBL_1431073 (CHEMBL3383189)
EC50
>8000±n/a nM
Citation
 van Niel, MBFauber, BPCartwright, MGaines, SKillen, JCRené, OWard, SIde Leon Boenig, GDeng, YEidenschenk, CEverett, CGancia, EGanguli, AGobbi, AHawkins, JJohnson, ARKiefer, JRLa, HLockey, PNorman, MOuyang, WQin, AWakes, NWaszkowycz, BWong, H A reversed sulfonamide series of selective RORc inverse agonists. Bioorg Med Chem Lett 24:5769-76 (2014)  
Target
Name:
Nuclear receptor ROR-beta
Synonyms:
NR1F2 Nuclear receptor subfamily 1 group F member 2 RORB_HUMAN Retinoid-related orphan receptor-beta
Type:
PROTEIN
Mol. Mass.:
53227.30
Organism:
Homo sapiens (Human)
Description:
ChEMBL_107979
Residue:
470
  
Inhibitor
Name:
BDBM50035918
Synonyms:
CHEMBL3361061
Type:
Small organic molecule
Emp. Form.:
C23H29N3O5S2
Mol. Mass.:
491.623
SMILES:
CC(C)CN(c1ccc(cc1)C#N)S(=O)(=O)c1ccc(OC2CCN(CC2)S(C)(=O)=O)cc1
: