Target
Nuclear receptor ROR-gamma
Ligand
BDBM50035918
Substrate
Meas. Tech.
ChEMBL_1442780 (CHEMBL3375302)
IC50
15±n/a nM
Citation
 van Niel, MBFauber, BPCartwright, MGaines, SKillen, JCRené, OWard, SIde Leon Boenig, GDeng, YEidenschenk, CEverett, CGancia, EGanguli, AGobbi, AHawkins, JJohnson, ARKiefer, JRLa, HLockey, PNorman, MOuyang, WQin, AWakes, NWaszkowycz, BWong, H A reversed sulfonamide series of selective RORc inverse agonists. Bioorg Med Chem Lett 24:5769-76 (2014)  
Target
Name:
Nuclear receptor ROR-gamma
Synonyms:
NR1F3 Nuclear receptor ROR-gamma (RORC) RAR-related orphan receptor C (RORc) RORG RZRG Retinoid-related orphan receptor-gamma (RORc)
Type:
Enzyme Catalytic Domain
Mol. Mass.:
58218.40
Organism:
Homo sapiens (Human)
Description:
P51449
Residue:
518
  
Inhibitor
Name:
BDBM50035918
Synonyms:
CHEMBL3361061
Type:
Small organic molecule
Emp. Form.:
C23H29N3O5S2
Mol. Mass.:
491.623
SMILES:
CC(C)CN(c1ccc(cc1)C#N)S(=O)(=O)c1ccc(OC2CCN(CC2)S(C)(=O)=O)cc1
: