Target
Cannabinoid receptor 1
Ligand
BDBM50040960
Substrate
Meas. Tech.
ChEMBL_1444764 (CHEMBL3378465)
EC50
>30000±n/a nM
Citation
 Han, SThoresen, LZhu, XNarayanan, SJung, JKStrah-Pleynet, SDecaire, MChoi, KXiong, YYue, DSemple, GThatte, JSolomon, MFu, LWhelan, KAl-Shamma, HGatlin, JChen, RDang, HPride, CGaidarov, IUnett, DJBehan, DPSadeque, AUsmani, KAChen, CEdwards, JMorgan, MJones, RM Discovery of 1a,2,5,5a-tetrahydro-1H-2,3-diaza-cyclopropa[a]pentalen-4-carboxamides as potent and selective CB2 receptor agonists. Bioorg Med Chem Lett 25:322-6 (2014)  
Target
Name:
Cannabinoid receptor 1
Synonyms:
CANN6 CB-R CNR CNR1_HUMAN Cannabinoid receptor Cannabinoid receptor 1 (brain)
Type:
G Protein-Coupled Receptor (GPCR)
Mol. Mass.:
52868.96
Organism:
Homo sapiens (Human)
Description:
P21554
Residue:
472
  
Inhibitor
Name:
BDBM50040960
Synonyms:
CHEMBL3354956
Type:
Small organic molecule
Emp. Form.:
C22H19F2N3O2
Mol. Mass.:
395.402
SMILES:
[H][C@]12C[C@@]1([H])c1c(C2)c(nn1-c1ccc(F)cc1F)C(=O)N[C@H](CO)c1ccccc1
: