Target
Serine/threonine-protein kinase PLK4
Ligand
BDBM50044654
Substrate
Meas. Tech.
ChEMBL_1450851 (CHEMBL3364610)
IC50
1.4±n/a nM
Citation
 Sampson, PBLiu, YPatel, NKFeher, MForrest, BLi, SWEdwards, LLaufer, RLang, YBan, FAwrey, DEMao, GPlotnikova, OLeung, GHodgson, RMason, JMWei, XKiarash, RGreen, EQiu, WChirgadze, NYMak, TWPan, GPauls, HW The discovery of Polo-like kinase 4 inhibitors: design and optimization of spiro[cyclopropane-1,3'[3H]indol]-2'(1'H).ones as orally bioavailable antitumor agents. J Med Chem 58:130-46 (2015)  
Target
Name:
Serine/threonine-protein kinase PLK4
Synonyms:
PLK4 Polo-Like Kinase 4 STK18 | Serine/threonine-protein kinase PLK4
Type:
PROTEIN
Mol. Mass.:
108996.91
Organism:
Homo sapiens (Human)
Description:
ChEMBL_1474078
Residue:
970
  
Inhibitor
Name:
BDBM50044654
Synonyms:
CHEMBL3353346 | US9907800, Example A62
Type:
Small organic molecule
Emp. Form.:
C31H31N5O2
Mol. Mass.:
505.6101
SMILES:
COc1ccc2NC(=O)[C@@]3(C[C@H]3c3ccc4c(\C=C\c5ccc(CN6CCCCC6)nc5)n[nH]c4c3)c2c1
: