Target
Urotensin-2 receptor
Ligand
BDBM50320463
Substrate
Meas. Tech.
ChEMBL_1451066 (CHEMBL3366481)
Ki
0.251189±n/a nM
Citation
 Carotenuto, AAuriemma, LMerlino, FYousif, AMMarasco, DLimatola, ACampiglia, PGomez-Monterrey, ISanticioli, PMeini, SMaggi, CANovellino, EGrieco, P Lead optimization of P5U and urantide: discovery of novel potent ligands at the urotensin-II receptor. J Med Chem 57:5965-74 (2014)  
Target
Name:
Urotensin-2 receptor
Synonyms:
G-protein coupled receptor 14 UR-II-R UTS2R Urotensin-II
Type:
Enzyme Catalytic Domain
Mol. Mass.:
42159.71
Organism:
Homo sapiens (Human)
Description:
Urotensin-II UTS2R HUMAN::Q9UKP6
Residue:
389
  
Inhibitor
Name:
BDBM50320463
Synonyms:
CHEMBL218994 H-Asp-Cys-Phe-Trp-Lys-Tyr-Cys-Val-OH
Type:
Small organic molecule
Emp. Form.:
C50H64N10O12S2
Mol. Mass.:
1061.233
SMILES:
CC(C)[C@H](NC(=O)[C@@H]1CSSC[C@H](NC(=O)[C@@H](N)CC(O)=O)C(=O)N[C@@H](Cc2ccccc2)C(=O)N[C@@H](Cc2c[nH]c3ccccc23)C(=O)N[C@@H](CCCCN)C(=O)N[C@@H](Cc2ccc(O)cc2)C(=O)N1)C(O)=O
: