Target
Potassium channel subfamily K member 9
Ligand
BDBM50050447
Substrate
Meas. Tech.
ChEMBL_1457494 (CHEMBL3367861)
IC50
5900±n/a nM
Citation
 Flaherty, DPSimpson, DSMiller, MMaki, BEZou, BShi, JWu, MMcManus, OBAubé, JLi, MGolden, JE Potent and selective inhibitors of the TASK-1 potassium channel through chemical optimization of a bis-amide scaffold. Bioorg Med Chem Lett 24:3968-73 (2014)  
Target
Name:
Potassium channel subfamily K member 9
Synonyms:
Acid-sensitive potassium channel protein TASK-3 KCNK9_HUMAN TWIK-related acid-sensitive K(+) channel 3 Two pore potassium channel KT3.2
Type:
PROTEIN
Mol. Mass.:
42276.04
Organism:
Homo sapiens (Human)
Description:
ChEMBL_1457494
Residue:
374
  
Inhibitor
Name:
BDBM50050447
Synonyms:
CHEMBL1716797
Type:
Small organic molecule
Emp. Form.:
C18H14N2O3
Mol. Mass.:
306.3154
SMILES:
O=C(Nc1cccc(NC(=O)c2ccccc2)c1)c1ccco1
: