Target
Tyrosine-protein phosphatase non-receptor type 11
Ligand
BDBM50054259
Substrate
Meas. Tech.
ChEMBL_1458320 (CHEMBL3369282)
IC50
370±n/a nM
Citation
 Zeng, LFZhang, RYYu, ZHLi, SWu, LGunawan, AMLane, BSMali, RSLi, XChan, RJKapur, RWells, CDZhang, ZY Therapeutic potential of targeting the oncogenic SHP2 phosphatase. J Med Chem 57:6594-609 (2014)  
Target
Name:
Tyrosine-protein phosphatase non-receptor type 11
Synonyms:
PTN11_HUMAN PTP-2C PTPN11 Protein tyrosine phosphatase (PTP) Shp2 Protein-tyrosine phosphatase 2C SHP2 Src homology phosphatase 2 (SHP-2) Tyrosine-protein phosphatase non-receptor type 11 (PTPN11) Tyrosine-protein phosphatase non-receptor type 11 (SHP2)
Type:
Protein phosphatase
Mol. Mass.:
68443.59
Organism:
Homo sapiens (Human)
Description:
Q06124
Residue:
597
  
Inhibitor
Name:
BDBM50054259
Synonyms:
CHEMBL3319378 | US9522881, 11a-23 L97L03
Type:
Small organic molecule
Emp. Form.:
C29H22IN3O7
Mol. Mass.:
651.4054
SMILES:
Cn1c(c(I)c2cc(C(O)=O)c(O)cc12)-c1cccc(NC(=O)C(=O)Nc2ccccc2-c2ccc(CO)o2)c1
: