Target
P2Y purinoceptor 12
Ligand
BDBM50100247
Substrate
Meas. Tech.
ChEMBL_1454020 (CHEMBL3367079)
IC50
60±n/a nM
Citation
 Boldron, CBesse, ABordes, MFTissandié, SYvon, XGau, BBadorc, ARousseaux, TBarré, GMeneyrol, JZech, GNazare, MFossey, VPflieger, AMBonnet-Lignon, SMillet, LBriot, CDol, FHérault, JPSavi, PLassalle, GDelesque, NHerbert, JMBono, F N-[6-(4-butanoyl-5-methyl-1H-pyrazol-1-yl)pyridazin-3-yl]-5-chloro-1-[2-(4-methylpiperazin-1-yl)-2-oxoethyl]-1H-indole-3-carboxamide (SAR216471), a novel intravenous and oral, reversible, and directly acting P2Y12 antagonist. J Med Chem 57:7293-316 (2014)  
Target
Name:
P2Y purinoceptor 12
Synonyms:
P2Y purinoceptor 12 P2ry12 Purinergic receptor P2Y12
Type:
PROTEIN
Mol. Mass.:
39068.50
Organism:
Rattus norvegicus
Description:
ChEMBL_1454020
Residue:
343
  
Inhibitor
Name:
BDBM50100247
Synonyms:
CHEMBL3325891
Type:
Small organic molecule
Emp. Form.:
C28H31ClN8O3
Mol. Mass.:
563.051
SMILES:
CCCC(=O)c1cnn(c1C)-c1ccc(NC(=O)c2cn(CC(=O)N3CCN(C)CC3)c3ccc(Cl)cc23)nn1
: