Target
Poly [ADP-ribose] polymerase 1
Ligand
BDBM50055885
Substrate
Meas. Tech.
ChEMBL_1458598 (CHEMBL3371141)
IC50
95±n/a nM
Citation
 Wang, LXZhou, XBXiao, MLJiang, NLiu, FZhou, WXWang, XKZheng, ZBLi, S Synthesis and biological evaluation of substituted 4-(thiophen-2-ylmethyl)-2H-phthalazin-1-ones as potent PARP-1 inhibitors. Bioorg Med Chem Lett 24:3739-43 (2014)  
Target
Name:
Poly [ADP-ribose] polymerase 1
Synonyms:
(ARTD1 or PARP1) 2.4.2.30 ADPRT ARTD1 Human diphtheria toxin-like ADP-ribosyltransferase (ARTD1 or PARP1) NT-PARP-1 PARP1 PPOL Poly [ADP-ribose] polymerase 1 (PARP) Poly [ADP-ribose] polymerase 1 (PARP1) Poly [ADP-ribose] polymerase 1, 28-kDa form Poly [ADP-ribose] polymerase 1, processed C-terminus Poly [ADP-ribose] polymerase-1 Poly(ADP-ribose) polymerase-1 (ARTD1/PARP1) Protein poly-ADP-ribosyltransferase PARP1 | Synonyms=ADPRT
Type:
Mol. Mass.:
113114.22
Organism:
Homo sapiens (Human)
Description:
P09874
Residue:
1014
  
Inhibitor
Name:
BDBM50055885
Synonyms:
CHEMBL3317902
Type:
Small organic molecule
Emp. Form.:
C27H26N4O4S
Mol. Mass.:
502.585
SMILES:
COc1ccc(CC(=O)N2CCN(CC2)C(=O)c2csc(Cc3n[nH]c(=O)c4ccccc34)c2)cc1
: