Target
Dihydrofolate reductase
Ligand
BDBM50058716
Substrate
Meas. Tech.
ChEMBL_1448997 (CHEMBL3376894)
IC50
7000±n/a nM
Citation
 Al-Rashood, STHassan, GSEl-Messery, SMNagi, MNHabib, el-SEAl-Omary, FAEl-Subbagh, HI Synthesis, biological evaluation and molecular modeling study of 2-(1,3,4-thiadiazolyl-thio and 4-methyl-thiazolyl-thio)-quinazolin-4-ones as a new class of DHFR inhibitors. Bioorg Med Chem Lett 24:4557-67 (2014)  
Target
Name:
Dihydrofolate reductase
Synonyms:
DHFR Dihydrofolate reductase | Dihydrofolate reductase (DHFR)
Type:
Enzyme
Mol. Mass.:
21603.71
Organism:
Bos taurus (Cattle)
Description:
P00376
Residue:
187
  
Inhibitor
Name:
BDBM50058716
Synonyms:
CHEMBL3326825
Type:
Small organic molecule
Emp. Form.:
C20H18N4OS2
Mol. Mass.:
394.513
SMILES:
Cc1nc(N)sc1Sc1nc2ccc(C)cc2c(=O)n1-c1ccc(C)cc1
: