Target
Inosine-5'-monophosphate dehydrogenase
Ligand
BDBM50432770
Substrate
Meas. Tech.
ChEMBL_1452430 (CHEMBL3362092)
IC50
>5000±n/a nM
Citation
 Mandapati, KGorla, SKHouse, ALMcKenney, ESZhang, MRao, SNGollapalli, DRMann, BJGoldberg, JBCuny, GDGlomski, IJHedstrom, L Repurposing cryptosporidium inosine 5'-monophosphate dehydrogenase inhibitors as potential antibacterial agents. ACS Med Chem Lett 5:846-50 (2014)  
Target
Name:
Inosine-5'-monophosphate dehydrogenase
Synonyms:
Cgd6_20 protein Inosine-5'-monophosphate dehydrogenase, probable | Inosine-5-monophosphate dehydrogenase (IMPDH)
Type:
Protein
Mol. Mass.:
43076.80
Organism:
Cryptosporidium parvum
Description:
Q8T6T2
Residue:
400
  
Inhibitor
Name:
BDBM50432770
Synonyms:
CHEMBL2348631
Type:
Small organic molecule
Emp. Form.:
C21H17Cl2N3O3
Mol. Mass.:
430.284
SMILES:
C[C@H](Oc1cccc(Cl)c1Cl)C(=O)Nc1cccc(NC(=O)c2ccncc2)c1
: