Target
cGMP-specific 3',5'-cyclic phosphodiesterase
Ligand
BDBM50065691
Substrate
Meas. Tech.
ChEMBL_1464664 (CHEMBL3406685)
IC50
2.9±n/a nM
Citation
 Sakamoto, TKoga, YHikota, MMatsuki, KMochida, HKikkawa, KFujishige, KKotera, JOmori, KMorimoto, HYamada, K 8-(3-chloro-4-methoxybenzyl)-8H-pyrido[2,3-d]pyrimidin-7-one derivatives as potent and selective phosphodiesterase 5 inhibitors. Bioorg Med Chem Lett 25:1431-5 (2015)  
Target
Name:
cGMP-specific 3',5'-cyclic phosphodiesterase
Synonyms:
CGB-PDE PDE5A Phosphodiesterase 5A cGMP-specific 3',5'-cyclic phosphodiesterase
Type:
PROTEIN
Mol. Mass.:
98285.03
Organism:
Canis lupus familiaris
Description:
ChEMBL_105565
Residue:
865
  
Inhibitor
Name:
BDBM50065691
Synonyms:
CHEMBL3404011
Type:
Small organic molecule
Emp. Form.:
C24H32ClN5O4
Mol. Mass.:
489.995
SMILES:
COc1ccc(CNc2nc(ncc2C(=O)CCN2CCOCC2)N2CCC[C@H]2CO)cc1Cl
: