Target
Fatty acid synthase
Ligand
BDBM50070208
Substrate
Meas. Tech.
ChEMBL_1467001 (CHEMBL3411198)
IC50
46700±n/a nM
Citation
 Fako, VEWu, XPflug, BLiu, JYZhang, JT Repositioning proton pump inhibitors as anticancer drugs by targeting the thioesterase domain of human fatty acid synthase. J Med Chem 58:778-84 (2015)  
Target
Name:
Fatty acid synthase
Synonyms:
FAS FAS_HUMAN HU FASN
Type:
Enzyme
Mol. Mass.:
273419.37
Organism:
Homo sapiens (Human)
Description:
P49327
Residue:
2511
  
Inhibitor
Name:
BDBM50070208
Synonyms:
A-65006 CHEBI:6375 Prevacid Prevacid Delayed Release Prevacid iv
Type:
Small organic molecule
Emp. Form.:
C16H14F3N3O2S
Mol. Mass.:
369.361
SMILES:
Cc1c(OCC(F)(F)F)ccnc1C[S+]([O-])c1nc2ccccc2[nH]1
: