Target
Rho-associated protein kinase 1
Ligand
BDBM50072669
Substrate
Meas. Tech.
ChEMBL_1467104 (CHEMBL3411301)
IC50
>20000±n/a nM
Citation
 Yin, YZheng, KEid, NHoward, SJeong, JHYi, FGuo, JPark, CMBibian, MWu, WHernandez, PPark, HWu, YLuo, JLLoGrasso, PVFeng, Y Bis-aryl urea derivatives as potent and selective LIM kinase (Limk) inhibitors. J Med Chem 58:1846-61 (2015)  
Target
Name:
Rho-associated protein kinase 1
Synonyms:
ROCK-I ROCK1_HUMAN Rho-associated protein kinase Rho-associated, coiled-coil-containing protein kinase 1 Rho-kinase (ROCK I) p160 ROCK-1 | p160ROCK
Type:
Serine/threonine-protein kinase
Mol. Mass.:
158156.77
Organism:
Homo sapiens (Human)
Description:
Q13464
Residue:
1354
  
Inhibitor
Name:
BDBM50072669
Synonyms:
CHEMBL3410048
Type:
Small organic molecule
Emp. Form.:
C23H23N5O3
Mol. Mass.:
417.4604
SMILES:
COc1ccc(cc1)N(CCO)C(=O)Nc1ccc(cc1)-c1ncnc2[nH]cc(C)c12
: