Target
Amine oxidase [flavin-containing] A
Ligand
BDBM50073540
Substrate
Meas. Tech.
ChEMBL_1469710 (CHEMBL3413248)
IC50
7.3±n/a nM
Citation
 Khattab, SNAbdel Moneim, SABekhit, AAEl Massry, AMHassan, SYEl-Faham, AAli Ahmed, HEAmer, A Exploring new selective 3-benzylquinoxaline-based MAO-A inhibitors: design, synthesis, biological evaluation and docking studies. Eur J Med Chem 93:308-20 (2015)  
Target
Name:
Amine oxidase [flavin-containing] A
Synonyms:
AOFA_BOVIN MAO-A Monoamine Oxidase Type A (MAO-A) Monoamine oxidase A | Monoamine oxidase type A
Type:
PROTEIN
Mol. Mass.:
59764.63
Organism:
Bos taurus
Description:
ChEMBL_1501477
Residue:
527
  
Inhibitor
Name:
BDBM50073540
Synonyms:
CHEMBL3408927
Type:
Small organic molecule
Emp. Form.:
C25H19N5O3
Mol. Mass.:
437.4501
SMILES:
O=C(Cn1c2ccccc2nc(Cc2ccccc2)c1=O)N\N=C1\C(=O)Nc2ccccc12
: