Target
Orexin receptor type 2
Ligand
BDBM50074053
Substrate
Meas. Tech.
ChEMBL_1468062 (CHEMBL3413700)
IC50
4.0±n/a nM
Citation
 Sifferlen, TBoller, AChardonneau, ACottreel, EGatfield, JTreiber, ARoch, CJenck, FAissaoui, HWilliams, JTBrotschi, CHeidmann, BSiegrist, RBoss, C Substituted pyrrolidin-2-ones: Centrally acting orexin receptor antagonists promoting sleep. Part 2. Bioorg Med Chem Lett 25:1884-91 (2015)  
Target
Name:
Orexin receptor type 2
Synonyms:
HCRTR2 OX2R_HUMAN Orexin receptor type 2 (OR-2) Orexin receptor type 2 (OX2R) Ox-2-R | Ox2-R
Type:
Protein
Mol. Mass.:
50710.53
Organism:
Homo sapiens (Human)
Description:
O43614
Residue:
444
  
Inhibitor
Name:
BDBM50074053
Synonyms:
CHEMBL3409876
Type:
Small organic molecule
Emp. Form.:
C24H20FNO4
Mol. Mass.:
405.4183
SMILES:
COc1cccc(F)c1[C@@H]1C[C@@H](O)C(=O)N1Cc1ccc2oc3ccccc3c2c1
: