Target
Amine oxidase [flavin-containing] A
Ligand
BDBM50075969
Substrate
Meas. Tech.
ChEMBL_1473803 (CHEMBL3418528)
IC50
2.0±n/a nM
Citation
 Huleatt, PBKhoo, MLChua, YYTan, TWLiew, RSBalogh, BDeme, RGölöncsér, FMagyar, KSheela, DPHo, HKSperlágh, BMátyus, PChai, CL Novel arylalkenylpropargylamines as neuroprotective, potent, and selective monoamine oxidase B inhibitors for the treatment of Parkinson's disease. J Med Chem 58:1400-19 (2015)  
Target
Name:
Amine oxidase [flavin-containing] A
Synonyms:
AOFA_RAT Amine oxidase [flavin-containing] A Monoamine Oxidase Type A (MAO-A) Monoamine oxidase A (MAO-A) Monoamine oxidase type A (MAOA)
Type:
Enzyme
Mol. Mass.:
59515.21
Organism:
Rattus norvegicus (rat)
Description:
Residue:
526
  
Inhibitor
Name:
BDBM50075969
Synonyms:
CHEMBL3415617
Type:
Small organic molecule
Emp. Form.:
C22H22FNO5
Mol. Mass.:
399.4122
SMILES:
OC(=O)C([O-])=O.C[NH+](CC#C)CC(=C)c1cccc(OCc2cccc(F)c2)c1
: