Target
Catechol O-methyltransferase
Ligand
BDBM50086223
Substrate
Meas. Tech.
ChEMBL_1477936 (CHEMBL3429503)
IC50
160±n/a nM
Citation
 Harrison, STPoslusney, MSMulhearn, JJZhao, ZKett, NRSchubert, JWMelamed, JYAllison, TJPatel, SBSanders, JMSharma, SSmith, RFHall, DLRobinson, RGSachs, NAHutson, PHWolkenberg, SEBarrow, JC Synthesis and Evaluation of Heterocyclic Catechol Mimics as Inhibitors of Catechol-O-methyltransferase (COMT). ACS Med Chem Lett 6:318-23 (2015)  
Target
Name:
Catechol O-methyltransferase
Synonyms:
COMT Catechol O-methyltransferase | Catechol O-methyltransferase (MB-COMT)
Type:
Enzyme
Mol. Mass.:
30030.67
Organism:
Homo sapiens (Human)
Description:
P21964
Residue:
271
  
Inhibitor
Name:
BDBM50086223
Synonyms:
CHEMBL3425731
Type:
Small organic molecule
Emp. Form.:
C16H19NO3
Mol. Mass.:
273.327
SMILES:
CCCCc1ccc(cc1)-n1cc(O)c(=O)cc1CO
: