Target
Scavenger receptor class B member 1
Ligand
BDBM50069751
Substrate
Meas. Tech.
ChEMBL_1476715 (CHEMBL3429066)
IC50
5.0±n/a nM
Citation
 Dockendorff, CFaloon, PWGermain, AYu, MYoungsaye, WNag, PPBennion, MPenman, MNieland, TJDandapani, SPerez, JRMunoz, BPalmer, MASchreiber, SLKrieger, M Discovery of bisamide-heterocycles as inhibitors of scavenger receptor BI (SR-BI)-mediated lipid uptake. Bioorg Med Chem Lett 25:2594-8 (2015)  
Target
Name:
Scavenger receptor class B member 1
Synonyms:
SCRB1_MOUSE Scarb1 Srb1
Type:
PROTEIN
Mol. Mass.:
56761.39
Organism:
Mus musculus
Description:
ChEMBL_103999
Residue:
509
  
Inhibitor
Name:
BDBM50069751
Synonyms:
CHEMBL2356114
Type:
Small organic molecule
Emp. Form.:
C24H32N6O4
Mol. Mass.:
468.5487
SMILES:
C[C@@H](N(C1CCCCC1)C(=O)Cn1nnc(n1)-c1ccc2OCOc2c1)C(=O)NC1CCCC1
: