Target
Amine oxidase [flavin-containing] B
Ligand
BDBM15581
Substrate
Meas. Tech.
ChEMBL_1495690 (CHEMBL3578678)
IC50
98000±n/a nM
Citation
 El-Faham, AZainab Al Marhoon, naAbdel-Megeed, AKhattab, SNBekhit, AAAlbericio, F a-Ketoamino acid ester derivatives as promising MAO inhibitors. Bioorg Med Chem Lett 25:70-4 (2015)  
Target
Name:
Amine oxidase [flavin-containing] B
Synonyms:
AOFB_BOVIN MAO-B Monoamine Oxidase Type B (MAO-B) Monoamine oxidase B | Monoamine oxidase type B
Type:
PROTEIN
Mol. Mass.:
58428.94
Organism:
Bos taurus
Description:
ChEMBL_1501478
Residue:
520
  
Inhibitor
Name:
BDBM15581
Synonyms:
CHEMBL8706 CLORGILINE N-[3-(2,4-dichlorophenoxy)propyl]-N-methyl-prop-2-yn-1-amine US9603833, Clorgyline | [3-(2,4-dichlorophenoxy)propyl](methyl)prop-2-yn-1-ylamine
Type:
Small organic molecule
Emp. Form.:
C13H15Cl2NO
Mol. Mass.:
272.17
SMILES:
CN(CCCOc1ccc(Cl)cc1Cl)CC#C
: