Target
Macrophage-stimulating protein receptor
Ligand
BDBM50090966
Substrate
Meas. Tech.
ChEMBL_1499715 (CHEMBL3585031)
IC50
44±n/a nM
Citation
 Raeppel, SLRaeppel, FTherrien, E Design and synthesis of close analogs of LCRF-0004, a potent and selective RON receptor tyrosine kinase inhibitor. Bioorg Med Chem Lett 25:2527-31 (2015)  
Target
Name:
Macrophage-stimulating protein receptor
Synonyms:
2.7.10.1 CDw136 MST1R Macrophage-stimulating protein receptor alpha chain PTK8 RON Tyrosine kinase receptor ron | p185-Ron
Type:
Protein
Mol. Mass.:
152270.76
Organism:
Homo sapiens (Human)
Description:
Q04912
Residue:
1400
  
Inhibitor
Name:
BDBM50090966
Synonyms:
CHEMBL3582037
Type:
Small organic molecule
Emp. Form.:
C28H17F5N6O2S
Mol. Mass.:
596.531
SMILES:
Cn1cnc(c1)-c1cc2nccc(Oc3ccc(NC(=O)c4cnn(c4C(F)(F)F)-c4ccc(F)cc4)cc3F)c2s1
: