Target
Hepatocyte growth factor receptor
Ligand
BDBM50091369
Substrate
Meas. Tech.
ChEMBL_1497944 (CHEMBL3583343)
IC50
9.7±n/a nM
Citation
 Li, CAi, JZhang, DPeng, XChen, XGao, ZSu, YZhu, WJi, YChen, XGeng, MLiu, H Design, Synthesis, and Biological Evaluation of Novel Imidazo[1,2-a]pyridine Derivatives as Potent c-Met Inhibitors. ACS Med Chem Lett 6:507-12 (2015)  
Target
Name:
Hepatocyte growth factor receptor
Synonyms:
Hepatocyte growth factor receptor Hepatocyte growth factor receptor (c-MET) MET Met proto-oncogene (hepatocyte growth factor receptor) Tyrosine-protein kinase Met (c-Met) c-Met kinase
Type:
Protein
Mol. Mass.:
155559.73
Organism:
Homo sapiens (Human)
Description:
P08581
Residue:
1390
  
Inhibitor
Name:
BDBM50091369
Synonyms:
CHEMBL3582289
Type:
Small organic molecule
Emp. Form.:
C21H19FN4O
Mol. Mass.:
362.4002
SMILES:
CCO\N=C(/C)c1cc(F)c2ncc(Cc3ccc4ncccc4c3)n2c1
: