Target
Hepatocyte growth factor receptor
Ligand
BDBM163243
Substrate
Meas. Tech.
ChEMBL_1497944 (CHEMBL3583343)
IC50
1.000000±n/a nM
Citation
 Li, CAi, JZhang, DPeng, XChen, XGao, ZSu, YZhu, WJi, YChen, XGeng, MLiu, H Design, Synthesis, and Biological Evaluation of Novel Imidazo[1,2-a]pyridine Derivatives as Potent c-Met Inhibitors. ACS Med Chem Lett 6:507-12 (2015)  
Target
Name:
Hepatocyte growth factor receptor
Synonyms:
Hepatocyte growth factor receptor Hepatocyte growth factor receptor (c-MET) MET Met proto-oncogene (hepatocyte growth factor receptor) Tyrosine-protein kinase Met (c-Met) c-Met kinase
Type:
Protein
Mol. Mass.:
155559.73
Organism:
Homo sapiens (Human)
Description:
P08581
Residue:
1390
  
Inhibitor
Name:
BDBM163243
Synonyms:
US9062045, Comparator No. 1 (JNJ-38877605)
Type:
Small organic molecule
Emp. Form.:
C19H13F2N7
Mol. Mass.:
377.3502
SMILES:
Cn1cc(cn1)-c1ccc2nnc(n2n1)C(F)(F)c1ccc2ncccc2c1
: