Target
Orexin receptor type 2
Ligand
BDBM50092814
Substrate
Meas. Tech.
ChEMBL_1501723 (CHEMBL3587703)
Ki
10.0±n/a nM
Citation
 Letavic, MABonaventure, PCarruthers, NIDugovic, CKoudriakova, TLord, BLovenberg, TWLy, KSMani, NSNepomuceno, DPippel, DJRizzolio, MShelton, JEShah, CRShireman, BTYoung, LKYun, S Novel Octahydropyrrolo[3,4-c]pyrroles Are Selective Orexin-2 Antagonists: SAR Leading to a Clinical Candidate. J Med Chem 58:5620-36 (2015)  
Target
Name:
Orexin receptor type 2
Synonyms:
Hcrtr2 OX2R_RAT Orexin receptor type 2 (OX2) Ox-2-R Ox2R
Type:
Protein
Mol. Mass.:
52508.46
Organism:
Rattus norvegicus (Rat)
Description:
P56719
Residue:
460
  
Inhibitor
Name:
BDBM50092814
Synonyms:
CHEMBL3586436
Type:
Small organic molecule
Emp. Form.:
C21H22FN7O
Mol. Mass.:
407.4441
SMILES:
[H][C@@]12CN(C[C@]1([H])CN(C2)c1nc(C)cc(C)n1)C(=O)c1c(F)cccc1-n1nccn1
: