Target
G-protein coupled bile acid receptor 1
Ligand
BDBM50100559
Substrate
Meas. Tech.
ChEMBL_1456763 (CHEMBL3367085)
EC50
41±n/a nM
Citation
 Park, EJAhn, YGJung, SHBang, HJKim, MHong, DJKim, JSuh, KHKim, YJKim, DKim, EYLee, KMin, KH Discovery of novel pyrimidine and malonamide derivatives as TGR5 agonists. Bioorg Med Chem Lett 24:4271-5 (2014)  
Target
Name:
G-protein coupled bile acid receptor 1
Synonyms:
BG37 GPBAR_HUMAN TGR5 hGPCR19
Type:
G Protein-Coupled Receptor (GPCR)
Mol. Mass.:
35260.02
Organism:
Homo sapiens (Human)
Description:
CHO cells transiently transfected with hTGR5.
Residue:
330
  
Inhibitor
Name:
BDBM50100559
Synonyms:
CHEMBL3321844
Type:
Small organic molecule
Emp. Form.:
C20H16Cl2N4O2S
Mol. Mass.:
447.338
SMILES:
CSc1ncc(C(=O)N2CCNc3ccccc23)c(Oc2cc(Cl)ccc2Cl)n1
: