Target
Mu-type opioid receptor
Ligand
BDBM50100993
Substrate
Meas. Tech.
ChEMBL_1452451 (CHEMBL3362475)
Ki
0.700000±n/a nM
Citation
 Schunk, SLinz, KFrormann, SHinze, COberbörsch, SSundermann, BZemolka, SEnglberger, WGermann, TChristoph, TKögel, BYSchröder, WHarlfinger, SSaunders, DKless, ASchick, HSonnenschein, H Discovery of Spiro[cyclohexane-dihydropyrano[3,4-b]indole]-amines as Potent NOP and Opioid Receptor Agonists. ACS Med Chem Lett 5:851-6 (2014)  
Target
Name:
Mu-type opioid receptor
Synonyms:
M-OR-1 MOR-1 MUOR1 Mu opiate receptor OPRM1 hMOP | mu-type opioid receptor isoform MOR-1
Type:
G Protein-Coupled Receptor (GPCR)
Mol. Mass.:
44789.51
Organism:
Homo sapiens (Human)
Description:
P35372
Residue:
400
  
Inhibitor
Name:
BDBM50100993
Synonyms:
CHEMBL3325881
Type:
Small organic molecule
Emp. Form.:
C24H34ClN3O
Mol. Mass.:
415.999
SMILES:
Cl.CN(C)[C@]1(CC[C@@H](CC1)NC(=O)NCCCc1ccccc1)c1ccccc1
: