Target
Orexin/Hypocretin receptor type 1
Ligand
BDBM50108624
Substrate
Meas. Tech.
ChEMBL_1507897 (CHEMBL3598908)
Ki
10.0±n/a nM
Citation
 Boss, CRoch, C Recent trends in orexin research--2010 to 2015. Bioorg Med Chem Lett 25:2875-87 (2015)  
Target
Name:
Orexin/Hypocretin receptor type 1
Synonyms:
HCRTR1 OX1R_HUMAN Orexin receptor type 1 (OR 1) Orexin receptor type 1 (OX1) Orexin receptor type 1 (OxR1) | Ox1r
Type:
Protein
Mol. Mass.:
47554.50
Organism:
Homo sapiens (Human)
Description:
O43613
Residue:
425
  
Inhibitor
Name:
BDBM50108624
Synonyms:
CHEMBL3597966
Type:
Small organic molecule
Emp. Form.:
C23H21FN2O2S
Mol. Mass.:
408.488
SMILES:
Fc1ccc(OC[C@@H]2CC3CCC2N3C(=O)c2ccccc2-c2cccs2)nc1
: