Target
Serine/threonine-protein phosphatase 5
Ligand
BDBM50112356
Substrate
Meas. Tech.
ChEMBL_1513413 (CHEMBL3611568)
IC50
>50000±n/a nM
Citation
 He, RYu, ZHZhang, RYWu, LGunawan, AMLane, BSShim, JSZeng, LFHe, YChen, LWells, CDLiu, JOZhang, ZY Exploring the Existing Drug Space for Novel pTyr Mimetic and SHP2 Inhibitors. ACS Med Chem Lett 6:782-6 (2015)  
Target
Name:
Serine/threonine-protein phosphatase 5
Synonyms:
PP-T PPP5 PPP5_HUMAN Protein phosphatase 5 (PP5) Serine/threonine-protein phosphatase 5
Type:
Enzyme
Mol. Mass.:
56875.49
Organism:
Homo sapiens (Human)
Description:
P53041
Residue:
499
  
Inhibitor
Name:
BDBM50112356
Synonyms:
CHEMBL3609373
Type:
Small organic molecule
Emp. Form.:
C22H18IN3O6S
Mol. Mass.:
579.364
SMILES:
OS(=O)(=O)C(C(=O)Nc1ccc(NC(=O)C(=O)Nc2ccc(I)cc2)cc1)c1ccccc1
: