Target
C-C chemokine receptor type 9
Ligand
BDBM50113358
Substrate
Meas. Tech.
ChEMBL_1510356 (CHEMBL3607106)
IC50
9.0±n/a nM
Citation
 Zhang, JRomero, JChan, AGoss, JStucka, SCross, JChamberlain, BVaroglu, MChandonnet, HRyan, DLippa, B Biarylsulfonamide CCR9 inhibitors for inflammatory bowel disease. Bioorg Med Chem Lett 25:3661-4 (2015)  
Target
Name:
C-C chemokine receptor type 9
Synonyms:
CCR9 GPR28
Type:
PROTEIN
Mol. Mass.:
42023.90
Organism:
Homo sapiens (Human)
Description:
ChEMBL_1510356
Residue:
369
  
Inhibitor
Name:
BDBM50113358
Synonyms:
CHEMBL3604493
Type:
Small organic molecule
Emp. Form.:
C22H25ClN4O3S
Mol. Mass.:
460.977
SMILES:
CN(C)c1ncnc(c1O)-c1cc(Cl)ccc1NS(=O)(=O)c1ccc(cc1)C(C)(C)C
: