Target
Hepatocyte growth factor receptor
Ligand
BDBM50115203
Substrate
Meas. Tech.
ChEMBL_1513739 (CHEMBL3610849)
IC50
230±n/a nM
Citation
 Raeppel, FRaeppel, SLTherrien, E Design, synthesis and RON receptor tyrosine kinase inhibitory activity of new head groups analogs of LCRF-0004. Bioorg Med Chem Lett 25:3810-5 (2015)  
Target
Name:
Hepatocyte growth factor receptor
Synonyms:
Hepatocyte growth factor receptor Hepatocyte growth factor receptor (c-MET) MET Met proto-oncogene (hepatocyte growth factor receptor) Tyrosine-protein kinase Met (c-Met) c-Met kinase
Type:
Protein
Mol. Mass.:
155559.73
Organism:
Homo sapiens (Human)
Description:
P08581
Residue:
1390
  
Inhibitor
Name:
BDBM50115203
Synonyms:
CHEMBL3608551
Type:
Small organic molecule
Emp. Form.:
C32H22FN7O2S
Mol. Mass.:
587.626
SMILES:
Cn1cnc(c1)-c1cc2nccc(Oc3ccc(NC(=O)c4cnn(c4-c4cccnc4)-c4ccccc4)cc3F)c2s1
: