Target
Flap endonuclease 1
Ligand
BDBM50121880
Substrate
Meas. Tech.
ChEMBL_1517026 (CHEMBL3619485)
IC50
2100±n/a nM
Citation
 Chapman, TMWallace, CGillen, KJBakrania, PKhurana, PCoombs, PJFox, SBureau, EABrownlees, JMelton, DWSaxty, B N-Hydroxyimides and hydroxypyrimidinones as inhibitors of the DNA repair complex ERCC1-XPF. Bioorg Med Chem Lett 25:4104-8 (2015)  
Target
Name:
Flap endonuclease 1
Synonyms:
DNase IV FEN1 Flap structure-specific endonuclease 1 Maturation factor 1 hFEN-1
Type:
PROTEIN
Mol. Mass.:
42602.57
Organism:
Homo sapiens (Human)
Description:
ChEMBL_1517026
Residue:
380
  
Inhibitor
Name:
BDBM50121880
Synonyms:
CHEMBL216874
Type:
Small organic molecule
Emp. Form.:
C16H12FN3O3S
Mol. Mass.:
345.348
SMILES:
Oc1nc(nc(C(=O)NCc2ccc(F)cc2)c1O)-c1cccs1
: