Target
Cytoplasmic tyrosine-protein kinase BMX
Ligand
BDBM50123455
Substrate
Meas. Tech.
ChEMBL_1521546 (CHEMBL3627424)
IC50
119±n/a nM
Citation
 Liu, QBatt, DGLippy, JSSurti, NTebben, AJMuckelbauer, JKChen, LAn, YChang, CPokross, MYang, ZWang, HBurke, JRCarter, PHTino, JA Design and synthesis of carbazole carboxamides as promising inhibitors of Bruton's tyrosine kinase (BTK) and Janus kinase 2 (JAK2). Bioorg Med Chem Lett 25:4265-9 (2015)  
Target
Name:
Cytoplasmic tyrosine-protein kinase BMX
Synonyms:
BMX BMX_HUMAN Cytoplasmic tyrosine-protein kinase BMX (BMX) Epithelial and endothelial tyrosine kinase Tyrosine Kinase BMX | Tyrosine-protein kinase BMX/ETK
Type:
Tyrosine-protein kinase
Mol. Mass.:
78030.42
Organism:
Homo sapiens (Human)
Description:
P51813
Residue:
675
  
Inhibitor
Name:
BDBM50123455
Synonyms:
CHEMBL3621496
Type:
Small organic molecule
Emp. Form.:
C25H23FN4O2
Mol. Mass.:
430.4741
SMILES:
CN1CCN(CC1)C(=O)c1ccc2c(c1)[nH]c1c(ccc(-c3ccccc3F)c21)C(N)=O
: