Target
Amine oxidase [flavin-containing] B
Ligand
BDBM50127241
Substrate
Meas. Tech.
ChEMBL_1522272 (CHEMBL3630541)
IC50
>60000±n/a nM
Citation
 Ruan, BFCheng, HJRen, JLi, HLGuo, LLZhang, XXLiao, C Novel 2H-chromen-2-one derivatives of resveratrol: Design, synthesis, modeling and use as human monoamine oxidase inhibitors. Eur J Med Chem 103:185-90 (2015)  
Target
Name:
Amine oxidase [flavin-containing] B
Synonyms:
AOFB_HUMAN MAOB Monoamine oxidase type B (MAO B) Monoamine oxidase type B (MAOB)
Type:
Protein
Mol. Mass.:
58768.76
Organism:
Homo sapiens (Human)
Description:
P27338
Residue:
520
  
Inhibitor
Name:
BDBM50127241
Synonyms:
CHEMBL3629808
Type:
Small organic molecule
Emp. Form.:
C29H23BrO6
Mol. Mass.:
547.393
SMILES:
COc1ccc(\C=C\c2cc(OC)cc(OC)c2\C=C\C(=O)c2cc3cc(Br)ccc3oc2=O)cc1
: