Target
Acetyl-CoA carboxylase 1
Ligand
BDBM50127725
Substrate
Meas. Tech.
ChEMBL_1522981 (CHEMBL3631157)
IC50
11000±n/a nM
Citation
 Kung, DWGriffith, DAEsler, WPVajdos, FFMathiowetz, AMDoran, SDAmor, PABagley, SWBanks, TCabral, SFord, KGarcia-Irizarry, CNLandis, MSLoomis, KMcPherson, KNiosi, MRockwell, KLRose, CSmith, ACSouthers, JATapley, STu, MValentine, JJ Discovery of spirocyclic-diamine inhibitors of mammalian acetyl CoA-carboxylase. Bioorg Med Chem Lett 25:5352-6 (2015)  
Target
Name:
Acetyl-CoA carboxylase 1
Synonyms:
ACACA_RAT Acac Acetyl-CoA carboxylase Acetyl-CoA carboxylase 1 (ACC1)
Type:
Protein
Mol. Mass.:
265183.92
Organism:
Rattus norvegicus (Rat)
Description:
P11497
Residue:
2345
  
Inhibitor
Name:
BDBM50127725
Synonyms:
CHEMBL3629706
Type:
Small organic molecule
Emp. Form.:
C21H28N4O3
Mol. Mass.:
384.472
SMILES:
Cc1cc(cc2cn[nH]c12)C(=O)N1CCC2(CCN(C2)C(=O)OC(C)(C)C)C1
: