Target
Metallo-beta-lactamase VIM-2
Ligand
BDBM50129030
Substrate
Meas. Tech.
ChEMBL_1523078 (CHEMBL3631655)
IC50
12000±n/a nM
Citation
 Christopeit, TCarlsen, TJHelland, RLeiros, HK Discovery of Novel Inhibitor Scaffolds against the Metallo-ß-lactamase VIM-2 by Surface Plasmon Resonance (SPR) Based Fragment Screening. J Med Chem 58:8671-82 (2015)  
Target
Name:
Metallo-beta-lactamase VIM-2
Synonyms:
Beta-lactamase VIM-2 | Metallo-beta-lactamase VIM-2 (VIM-2)
Type:
Protein
Mol. Mass.:
28318.00
Organism:
Pseudomonas aeruginosa (g-Proteobacteria)
Description:
Residue:
266
  
Inhibitor
Name:
BDBM50129030
Synonyms:
CHEMBL81936
Type:
Small organic molecule
Emp. Form.:
C14H9ClO3
Mol. Mass.:
260.672
SMILES:
OC(=O)c1ccccc1C(=O)c1ccc(Cl)cc1
: