Target
Interleukin-1 receptor-associated kinase 4
Ligand
BDBM50130681
Substrate
Meas. Tech.
ChEMBL_1526987 (CHEMBL3637447)
IC50
3.0±n/a nM
Citation
 Lim, JAltman, MDBaker, JBrubaker, JDChen, HChen, YKleinschek, MALi, CLiu, DMaclean, JKMulrooney, EFPresland, JRakhilina, LSmith, GFYang, R Identification of N-(1H-pyrazol-4-yl)carboxamide inhibitors of interleukin-1 receptor associated kinase 4: Bicyclic core modifications. Bioorg Med Chem Lett 25:5384-8 (2015)  
Target
Name:
Interleukin-1 receptor-associated kinase 4
Synonyms:
IRAK-4 IRAK4_HUMAN Interleukin-1 receptor-associated kinase 4 (IRAK4) | Renal carcinoma antigen NY-REN-64
Type:
Protein
Mol. Mass.:
51519.08
Organism:
Homo sapiens (Human)
Description:
Q9NWZ3
Residue:
460
  
Inhibitor
Name:
BDBM50130681
Synonyms:
CHEMBL3634383
Type:
Small organic molecule
Emp. Form.:
C18H21F2N7OS
Mol. Mass.:
421.467
SMILES:
Cn1cc(NC(=O)c2csc3ncc(N[C@@H]4CCCC[C@@H]4N)nc23)c(n1)C(F)F
: