Target
Carbonic anhydrase 12
Ligand
BDBM50143990
Substrate
Meas. Tech.
ChEMBL_1551383 (CHEMBL3762504)
Ki
4.1±n/a nM
Citation
 Carradori, SSecci, DDe Monte, CMollica, ACeruso, MAkdemir, ASobolev, APCodispoti, RDe Cosmi, FGuglielmi, PSupuran, CT A novel library of saccharin and acesulfame derivatives as potent and selective inhibitors of carbonic anhydrase IX and XII isoforms. Bioorg Med Chem 24:1095-105 (2016)  
Target
Name:
Carbonic anhydrase 12
Synonyms:
CA-XII CAH12_HUMAN Carbonic anhydrase Carbonic anhydrase XII Carbonic anhydrase XII (CAXII) | Tumor antigen HOM-RCC-3.1.3
Type:
Enzyme
Mol. Mass.:
39456.00
Organism:
Homo sapiens (Human)
Description:
Catalytic domain of human cloned isozyme was used in the assay
Residue:
354
  
Inhibitor
Name:
BDBM50143990
Synonyms:
CHEMBL3759876
Type:
Small organic molecule
Emp. Form.:
C13H10N2O5S
Mol. Mass.:
306.294
SMILES:
CC1=CC(=O)N(CC(=O)c2ccc(cc2)C#N)S(=O)(=O)O1
: