Target
Carbonic anhydrase 1
Ligand
BDBM50143906
Substrate
Meas. Tech.
ChEMBL_1551380 (CHEMBL3762501)
Ki
1503±n/a nM
Citation
 Carradori, SSecci, DDe Monte, CMollica, ACeruso, MAkdemir, ASobolev, APCodispoti, RDe Cosmi, FGuglielmi, PSupuran, CT A novel library of saccharin and acesulfame derivatives as potent and selective inhibitors of carbonic anhydrase IX and XII isoforms. Bioorg Med Chem 24:1095-105 (2016)  
Target
Name:
Carbonic anhydrase 1
Synonyms:
CA-I CAB Carbonate dehydratase I Carbonic anhydrase 1 (CA I) Carbonic anhydrase 1 (Recombinant CA I) Carbonic anhydrase B Carbonic anhydrase I (CA I) Carbonic anhydrase I (CAI) Carbonic anhydrase isoenzyme I (hCA I) | hCA
Type:
Enzyme
Mol. Mass.:
28873.37
Organism:
Homo sapiens (Human)
Description:
P00915
Residue:
261
  
Inhibitor
Name:
BDBM50143906
Synonyms:
CHEMBL3758327
Type:
Small organic molecule
Emp. Form.:
C15H13NO3S
Mol. Mass.:
287.334
SMILES:
Cc1cccc(CN2C(=O)c3ccccc3S2(=O)=O)c1
: