Target
NAD-dependent protein deacetylase sirtuin-2
Ligand
BDBM50148789
Substrate
Meas. Tech.
ChEMBL_1557218 (CHEMBL3773441)
IC50
210±n/a nM
Citation
 Schiedel, MRumpf, TKaraman, BLehotzky, AOláh, JGerhardt, SOvádi, JSippl, WEinsle, OJung, M Aminothiazoles as Potent and Selective Sirt2 Inhibitors: A Structure-Activity Relationship Study. J Med Chem 59:1599-612 (2016)  
Target
Name:
NAD-dependent protein deacetylase sirtuin-2
Synonyms:
NAD-Dependent Deacetylase Sirtuin-2 NAD-dependent deacetylase sirtuin 3 SIR2-like SIR2L SIR2_HUMAN Sirtuin 2 (SIRT2)
Type:
Hydrolase
Mol. Mass.:
43172.62
Organism:
Homo sapiens (Human)
Description:
Residue:
389
  
Inhibitor
Name:
BDBM50148789
Synonyms:
CHEMBL3771286
Type:
Small organic molecule
Emp. Form.:
C22H19BrN4OS2
Mol. Mass.:
499.446
SMILES:
Cc1cc(C)nc(SCC(=O)Nc2ncc(Cc3cccc4ccc(Br)cc34)s2)n1
: