Target
Histone deacetylase 4
Ligand
BDBM50160874
Substrate
Meas. Tech.
ChEMBL_1571980 (CHEMBL3796508)
IC50
30±n/a nM
Citation
 Luckhurst, CABreccia, PStott, AJAziz, OBirch, HLBürli, RWHughes, SJJarvis, RELamers, MLeonard, PMMatthews, KLMcAllister, GPollack, SSaville-Stones, EWishart, GYates, DDominguez, C Potent, Selective, and CNS-Penetrant Tetrasubstituted Cyclopropane Class IIa Histone Deacetylase (HDAC) Inhibitors. ACS Med Chem Lett 7:34-9 (2016)  
Target
Name:
Histone deacetylase 4
Synonyms:
Cereblon/Histone deacetylase 4 HDAC4 Histone acetylase 4(HDAC4) KIAA0288
Type:
Enzyme
Mol. Mass.:
119049.39
Organism:
Homo sapiens (Human)
Description:
P56524
Residue:
1084
  
Inhibitor
Name:
BDBM50160874
Synonyms:
CHEMBL3794485 | US9505736, (1S,2S,3S)-2-(4-(5- (Difluoromethoxy)pyrimidin-2-yl)phenyl)-1- fluoro-N-hydroxy-3- phenylcyclopropanecarboxamide
Type:
Small organic molecule
Emp. Form.:
C21H16F3N3O3
Mol. Mass.:
415.3652
SMILES:
ONC(=O)[C@]1(F)[C@@H]([C@H]1c1ccc(cc1)-c1ncc(OC(F)F)cn1)c1ccccc1
: