Target
Histone deacetylase 4
Ligand
BDBM50160873
Substrate
Meas. Tech.
ChEMBL_1571859 (CHEMBL3796125)
IC50
430±n/a nM
Citation
 Luckhurst, CABreccia, PStott, AJAziz, OBirch, HLBürli, RWHughes, SJJarvis, RELamers, MLeonard, PMMatthews, KLMcAllister, GPollack, SSaville-Stones, EWishart, GYates, DDominguez, C Potent, Selective, and CNS-Penetrant Tetrasubstituted Cyclopropane Class IIa Histone Deacetylase (HDAC) Inhibitors. ACS Med Chem Lett 7:34-9 (2016)  
Target
Name:
Histone deacetylase 4
Synonyms:
Cereblon/Histone deacetylase 4 HDAC4 Histone acetylase 4(HDAC4) KIAA0288
Type:
Enzyme
Mol. Mass.:
119049.39
Organism:
Homo sapiens (Human)
Description:
P56524
Residue:
1084
  
Inhibitor
Name:
BDBM50160873
Synonyms:
CHEMBL3794544 | US9765054, Compound 50j
Type:
Small organic molecule
Emp. Form.:
C20H16ClN3O2
Mol. Mass.:
365.813
SMILES:
ONC(=O)[C@@H]1[C@@H]([C@H]1c1ccc(cc1)-c1ncc(Cl)cn1)c1ccccc1
: