Target
Nociceptin receptor
Ligand
BDBM50161405
Substrate
Meas. Tech.
ChEBML_1567392
Ki
30±n/a nM
Citation
 Hayashi, SOhashi, KMihara, SNakata, EEmoto, COhta, A Discovery of small-molecule nonpeptide antagonists of nociceptin/orphanin FQ receptor: The studies of design, synthesis, and structure-activity relationships for (4-arylpiperidine substituted-methyl)-[bicyclic (hetero)cycloalkanobenzene] derivatives. Eur J Med Chem 114:345-64 (2016)  
Target
Name:
Nociceptin receptor
Synonyms:
KOR-3 Mu-type opioid receptor (Mu) Nociceptin Receptor (ORL1 Receptor) Nociceptin receptor (ORL-1) Nociceptin/Orphanin FQ, NOP receptor OPIATE ORL-1 OPRL1 protein ORL1 Opioid receptor like-1 Orphanin FQ receptor (ORL1) | P41146
Type:
G Protein-Coupled Receptor (GPCR)
Mol. Mass.:
40702.87
Organism:
Homo sapiens (Human)
Description:
P41146
Residue:
370
  
Inhibitor
Name:
BDBM50161405
Synonyms:
CHEMBL3787051
Type:
Small organic molecule
Emp. Form.:
C25H30N2O
Mol. Mass.:
374.5185
SMILES:
CC(=O)N1Cc2ccccc2CC1CN1CCC2(CCc3ccccc23)CC1
: