Target
Peptidyl-prolyl cis-trans isomerase D
Ligand
BDBM50164673
Substrate
Meas. Tech.
ChEMBL_1575776 (CHEMBL3801395)
Kd
22700±n/a nM
Citation
 Shore, ERAwais, MKershaw, NMGibson, RRPandalaneni, SLatawiec, DWen, LJaved, MACriddle, DNBerry, NO'Neill, PMLian, LYSutton, R Small Molecule Inhibitors of Cyclophilin D To Protect Mitochondrial Function as a Potential Treatment for Acute Pancreatitis. J Med Chem 59:2596-611 (2016)  
Target
Name:
Peptidyl-prolyl cis-trans isomerase D
Synonyms:
40 kDa peptidyl-prolyl cis-trans isomerase CYP40 Cyclophilin D (CypD) Cyclophilin-related protein PPID_HUMAN Peptidyl-prolyl cis-trans isomerase D | Rotamase D
Type:
Protein
Mol. Mass.:
40766.62
Organism:
Homo sapiens (Human)
Description:
Q08752
Residue:
370
  
Inhibitor
Name:
BDBM50164673
Synonyms:
CHEMBL3797905
Type:
Small organic molecule
Emp. Form.:
C14H20N4O2
Mol. Mass.:
276.3342
SMILES:
Nc1ccc(CNC(=O)NCC(=O)N2CCCC2)cc1
: