Target
Melanocyte-stimulating hormone receptor
Ligand
BDBM50164805
Substrate
Meas. Tech.
ChEMBL_1576041 (CHEMBL3803373)
IC50
225±n/a nM
Citation
 Lensing, CJFreeman, KTSchnell, SMAdank, DNSpeth, RCHaskell-Luevano, C An in Vitro and in Vivo Investigation of Bivalent Ligands That Display Preferential Binding and Functional Activity for Different Melanocortin Receptor Homodimers. J Med Chem 59:3112-28 (2016)  
Target
Name:
Melanocyte-stimulating hormone receptor
Synonyms:
MC1-R Mc1r Melanocyte-stimulating hormone receptor | Msh-r
Type:
PROTEIN
Mol. Mass.:
35238.60
Organism:
Mus musculus
Description:
ChEMBL_1498846
Residue:
315
  
Inhibitor
Name:
BDBM50164805
Synonyms:
CHEMBL3798845
Type:
Small organic molecule
Emp. Form.:
C76H103N23O17
Mol. Mass.:
1610.7749
SMILES:
CC(=O)NC(Cc1cnc[nH]1)C(=O)NC(Cc1ccccc1)C(=O)NC(CCCNC(N)=N)C(=O)NC(Cc1c[nH]c2ccccc12)C(=O)N1CCCC1C(=O)NCC(=O)N1CCCC1C(=O)NCC(=O)N1CCCC1C(=O)NCC(=O)N1CCCC1C(=O)NCC(=O)N1CCCC1C(=O)NCC(=O)N1CCCC1C(=O)NCC(N)=O
: