Target
Fibroblast growth factor receptor 2
Ligand
BDBM50166780
Substrate
Meas. Tech.
ChEMBL_1572615 (CHEMBL3803148)
IC50
>200±n/a nM
Citation
 Fan, JDai, YShao, JPeng, XWang, CCao, SZhao, BAi, JGeng, MDuan, W Design, synthesis and biological evaluation of pyrazolylaminoquinazoline derivatives as highly potent pan-fibroblast growth factor receptor inhibitors. Bioorg Med Chem Lett 26:2594-9 (2016)  
Target
Name:
Fibroblast growth factor receptor 2
Synonyms:
BEK FGFR-2 FGFR2 Fibroblast growth factor receptor 2 (FGFR2) KGFR Keratinocyte growth factor receptor VEGF-receptor 2 and Fibroblast growth factor receptor 2
Type:
Enzyme
Mol. Mass.:
92015.45
Organism:
Homo sapiens (Human)
Description:
P21802
Residue:
821
  
Inhibitor
Name:
BDBM50166780
Synonyms:
CHEMBL3799024
Type:
Small organic molecule
Emp. Form.:
C21H20ClN5O2
Mol. Mass.:
409.869
SMILES:
COc1cc(CCc2cc(Nc3ncnc4cccc(Cl)c34)n[nH]2)cc(OC)c1
: