Target
Lanosterol synthase
Ligand
BDBM50167084
Substrate
Meas. Tech.
ChEMBL_1573537 (CHEMBL3801492)
IC50
35±n/a nM
Citation
 Zhao, ZHarrison, STSchubert, JWSanders, JMPolsky-Fisher, SZhang, NRMcLoughlin, DGibson, CRRobinson, RGSachs, NAKandebo, MYao, LSmith, SMHutson, PHWolkenberg, SEBarrow, JC Synthesis and optimization of N-heterocyclic pyridinones as catechol-O-methyltransferase (COMT) inhibitors. Bioorg Med Chem Lett 26:2952-2956 (2016)  
Target
Name:
Lanosterol synthase
Synonyms:
LSS_RAT Osc
Type:
PROTEIN
Mol. Mass.:
83302.12
Organism:
Rattus norvegicus
Description:
ChEMBL_12083
Residue:
733
  
Inhibitor
Name:
BDBM50167084
Synonyms:
CHEMBL3798524
Type:
Small organic molecule
Emp. Form.:
C16H10Cl2N2O2
Mol. Mass.:
333.169
SMILES:
Oc1cn(ccc1=O)-c1cc(ccn1)-c1ccc(Cl)c(Cl)c1
: