Target
Hexokinase-2
Ligand
BDBM50169031
Substrate
Meas. Tech.
ChEMBL_1577558 (CHEMBL3807034)
IC50
25±n/a nM
Citation
 Lin, HZeng, JXie, RSchulz, MJTedesco, RQu, JErhard, KFMack, JFRaha, KRendina, ARSzewczuk, LMKratz, PMJurewicz, AJCecconie, TMartens, SMcDevitt, PJMartin, JDChen, SBJiang, YNickels, LSchwartz, BJSmallwood, AZhao, BCampobasso, NQian, YBriand, JRominger, CMOleykowski, CHardwicke, MALuengo, JI Discovery of a Novel 2,6-Disubstituted Glucosamine Series of Potent and Selective Hexokinase 2 Inhibitors. ACS Med Chem Lett 7:217-22 (2016)  
Target
Name:
Hexokinase-2
Synonyms:
HK II HXK2_HUMAN Hexokinase-2 | Muscle form hexokinase
Type:
PROTEIN
Mol. Mass.:
102369.70
Organism:
Homo sapiens (Human)
Description:
ChEMBL_11422
Residue:
917
  
Inhibitor
Name:
BDBM50169031
Synonyms:
CHEMBL3805905
Type:
Small organic molecule
Emp. Form.:
C25H24Cl2N2O7S
Mol. Mass.:
567.438
SMILES:
OC1O[C@H](CNS(=O)(=O)c2cccc(Cl)c2Cl)[C@@H](O)[C@H](O)[C@H]1NC(=O)c1cccc(c1)-c1ccccc1
: