Target
C-C chemokine receptor type 9
Ligand
BDBM50178713
Substrate
Meas. Tech.
ChEMBL_1583874 (CHEMBL3815306)
IC50
75±n/a nM
Citation
 Pandya, BABaber, CChan, AChamberlain, BChandonnet, HGoss, JHopper, TLippa, BPoutsiaka, KRomero, JStucka, SVaroglu, MZhang, JZhang, X Discovery of indole inhibitors of chemokine receptor 9 (CCR9). Bioorg Med Chem Lett 26:3322-3325 (2016)  
Target
Name:
C-C chemokine receptor type 9
Synonyms:
CCR9 GPR28
Type:
PROTEIN
Mol. Mass.:
42023.90
Organism:
Homo sapiens (Human)
Description:
ChEMBL_1510356
Residue:
369
  
Inhibitor
Name:
BDBM50178713
Synonyms:
CHEMBL3815051
Type:
Small organic molecule
Emp. Form.:
C21H23NO3
Mol. Mass.:
337.4122
SMILES:
COc1ccc2cc(C(O)=O)n(Cc3ccc(cc3)C(C)(C)C)c2c1
: