Target
Glucagon-like peptide 2 receptor
Ligand
BDBM50183898
Substrate
Meas. Tech.
ChEMBL_1586856 (CHEMBL3824476)
EC50
0.220000±n/a nM
Citation
 Wisniewski, KSueiras-Diaz, JJiang, GGalyean, RLu, MThompson, DWang, YCCroston, GPosch, AHargrove, DMWisniewska, HLaporte, RDwyer, JJQi, SSrinivasan, KHartwig, JFerdyan, NMares, MKraus, JAlagarsamy, SRivière, PJSchteingart, CD Synthesis and Pharmacological Characterization of Novel Glucagon-like Peptide-2 (GLP-2) Analogues with Low Systemic Clearance. J Med Chem 59:3129-39 (2016)  
Target
Name:
Glucagon-like peptide 2 receptor
Synonyms:
GLP-2 receptor GLP-2R GLP2R_HUMAN
Type:
PROTEIN
Mol. Mass.:
63023.90
Organism:
Homo sapiens (Human)
Description:
ChEMBL_876141
Residue:
553
  
Inhibitor
Name:
BDBM50183898
Synonyms:
CHEMBL3824179
Type:
Small organic molecule
Emp. Form.:
C150H230N42O48S
Mol. Mass.:
3421.749
SMILES:
CC[C@H](C)[C@H](NC(=O)[C@H](CC(C)C)NC(=O)[C@H](Cc1c[nH]c2ccccc12)NC(=O)[C@H](CC(N)=O)NC(=O)[C@@H](NC(=O)[C@H](Cc1ccccc1)NC(=O)[C@H](CC(O)=O)NC(=O)[C@H](CCCNC(N)=N)NC(=O)[C@H](C)NC(=O)[C@H](C)NC(=O)[C@H](CC(C)C)NC(=O)[C@H](CC(N)=O)NC(=O)[C@H](CC(O)=O)NC(=O)[C@H](CC(C)C)NC(=O)[C@@H](NC(=O)[C@@H](NC(=O)[C@H](CC(N)=O)NC(=O)[C@H](CCSC)NC(=O)[C@H](CCC(O)=O)NC(=O)[C@H](CC(O)=O)NC(=O)[C@H](CO)NC(=O)[C@H](Cc1ccccc1)NC(=O)[C@H](CO)NC(=O)CNC(=O)[C@H](CC(O)=O)NC(=O)CNC(=O)[C@@H](N)Cc1cnc[nH]1)[C@@H](C)O)[C@@H](C)CC)[C@@H](C)CC)C(=O)N[C@@H](CCC(N)=O)C(=O)N[C@@H]([C@@H](C)O)C(=O)N[C@@H](CCCCN)C(N)=O
: